{"text_format":"1","workbook":"xlsx","n_sheets":3,"sheets":["Master","Species","Rank"],"not_rendered":{"charts":0,"images":0,"macros":1,"external_links":0,"defined_names":6,"comments":0,"pivot_tables":0},"unopened":[],"bounds":{"document_bytes":16777216,"sheet_cells":100000,"rows_first":2000,"rows_last":500,"rows_between":2000,"halvings":0,"cell_chars":16384,"cell_head_chars":4096},"cells_cut":0,"cells_raw":0,"read":"whole","date_system":"1900"}

{"sheet":"Master","index":0,"n_rows":526,"n_cols":52,"rows_kept":526,"cut":false,"hidden":false,"merged":[]}
["KEY: BLUE=Common;\nGREEN=Uncommon; \nYELLOW=Harder to find, usually seen annually;\nORANGE=Rare, 5+records;\nRED=Fewer than 5 records; \nBLACK=extirpated; \nGRAY=Introduced.","Ctrl+n to generate a\nNeeds List for a county\n\nCtrl+l to generate a\n Life List for a county\n\nCtrl+k to generate a\n County Checklist","Clallam","Clark","Cowlitz","Grays Harbor","Island","Jefferson","King","Kitsap","Lewis","Mason","Pacific","Pierce","San Juan","Skagit","Skamania","Snohomish","Thurston","Wahkiakum","Whatcom",null,"Adams","Asotin","Benton","Chelan","Columbia","Douglas","Ferry","Franklin","Garfield","Grant","Kittitas","Klickitat","Lincoln","Okanogan","Pend Oreille","Spokane","Stevens","Walla Walla","Whitman","Yakima",null,{"$f":"(\"Western WA total: \"&(SUM(SUM(IF(AR4:AR523>0, 1,0)))) &\"          (W.WA possible: 505)\")","v":"Western WA total: 0          (W.WA possible: 505)"},{"$f":" (\"Eastern WA total: \"&(SUM(SUM(IF(AS4:AS523>0, 1,0)))) &\"      (E.WA possible: 417)\")","v":"Eastern WA total: 0      (E.WA possible: 417)"},{"$f":"(\"Washington State total: \"&(SUM(SUM(IF(AT4:AT523>0,1,0))))&\"     (Statewide possible: 520)\")","v":"Washington State total: 0     (Statewide possible: 520)"},null,"eBird Sort Order","older AOU order","2017 AOU 58 order","2018 AOU 59 order","CURRENT 2019 AOU 60 order"]
["(credits at bottom)","County totals (right->)",396,328,281,399,314,331,391,330,277,278,365,355,332,370,293,370,332,262,369,null,305,297,319,317,260,318,268,298,249,340,321,309,310,321,281,311,285,345,303,329,null,"W.WA Counties: 19","E.WA Counties: 20","Total WA counties: 39",null,0,0,0,0,0]
["COMMON NAME(below)","SCIENTIFIC NAME(below)\n                My County totals (right->)",{"$f":"SUM(C4:C526)","v":0},0,0,0,0,0,0,0,0,0,0,0,0,0,0,0,0,0,0,null,{"$f":"SUM(W4:W526)","v":0},0,0,0,0,0,0,0,0,0,0,0,0,0,0,0,0,0,0,0,null,"# of counties seen in:","# of counties seen in:","WA Statewide \n# of counties seen in ",null,0.5,0.5,0.5,0.5,0.5]
["Fulvous Whistling-Duck","Dendrocygna bicolor",null,null,null,null,null,null,null,null,null,null,null,null,null,null,null,null,null,null,null,null,null,null,null,null,null,null,null,null,null,null,null,null,null,null,null,null,null,null,null,null,null,{"$f":"SUM(C4:U4)","v":0},{"$f":"SUM(W4:AP4)","v":0},{"$f":"SUM(C4:AP4)","v":0},null,1,57,1,1,1]
["Emperor Goose","Anser canagicus",null,null,null,null,null,null,null,null,null,null,null,null,null,null,null,null,null,null,null,null,null,null,null,null,null,null,null,null,null,null,null,null,null,null,null,null,null,null,null,null,null,0,0,0,null,2,60,2,2,2]
["Snow Goose","Anser caerulescens",null,null,null,null,null,null,null,null,null,null,null,null,null,null,null,null,null,null,null,null,null,null,null,null,null,null,null,null,null,null,null,null,null,null,null,null,null,null,null,null,null,0,0,0,null,3,61,3,3,3]
["Ross's Goose","Anser rossii",null,null,null,null,null,null,null,null,null,null,null,null,null,null,null,null,null,null,null,null,null,null,null,null,null,null,null,null,null,null,null,null,null,null,null,null,null,null,null,null,null,0,0,0,null,4,62,4,4,4]
["Greater White-fronted Goose","Anser albifrons",null,null,null,null,null,null,null,null,null,null,null,null,null,null,null,null,null,null,null,null,null,null,null,null,null,null,null,null,null,null,null,null,null,null,null,null,null,null,null,null,null,0,0,0,null,5,59,5,5,5]
["Taiga Bean-Goose","Anser fabalis",null,null,null,null,null,null,null,null,null,null,null,null,null,null,null,null,null,null,null,null,null,null,null,null,null,null,null,null,null,null,null,null,null,null,null,null,null,null,null,null,null,0,0,0,null,6,58,6,6,6]
["Brant","Branta bernicla",null,null,null,null,null,null,null,null,null,null,null,null,null,null,null,null,null,null,null,null,null,null,null,null,null,null,null,null,null,null,null,null,null,null,null,null,null,null,null,null,null,0,0,0,null,7,65,7,7,7]
["Cackling Goose","Branta hutchinsii",null,null,null,null,null,null,null,null,null,null,null,null,null,null,null,null,null,null,null,null,null,null,null,null,null,null,null,null,null,null,null,null,null,null,null,null,null,null,null,null,null,0,0,0,null,8,63,8,8,8]
["Canada Goose","Branta canadensis",null,null,null,null,null,null,null,null,null,null,null,null,null,null,null,null,null,null,null,null,null,null,null,null,null,null,null,null,null,null,null,null,null,null,null,null,null,null,null,null,null,0,0,0,null,9,64,9,9,9]
["Mute Swan*","Cygnus olor",null,null,null,null,null,null,null,null,null,null,null,null,null,null,null,null,null,null,null,null,null,null,null,null,null,null,null,null,null,null,null,null,null,null,null,null,null,null,null,null,null,0,0,0,null,10,66,10,10,10]
["Trumpeter Swan","Cygnus buccinator",null,null,null,null,null,null,null,null,null,null,null,null,null,null,null,null,null,null,null,null,null,null,null,null,null,null,null,null,null,null,null,null,null,null,null,null,null,null,null,null,null,0,0,0,null,11,67,11,11,11]
["Tundra Swan","Cygnus columbianus",null,null,null,null,null,null,null,null,null,null,null,null,null,null,null,null,null,null,null,null,null,null,null,null,null,null,null,null,null,null,null,null,null,null,null,null,null,null,null,null,null,0,0,0,null,12,68,12,12,12]
["Whooper Swan","Cygnus cygnus",null,null,null,null,null,null,null,null,null,null,null,null,null,null,null,null,null,null,null,null,null,null,null,null,null,null,null,null,null,null,null,null,null,null,null,null,null,null,null,null,null,0,0,0,null,13,69,13,13,13]
["Wood Duck","Aix sponsa",null,null,null,null,null,null,null,null,null,null,null,null,null,null,null,null,null,null,null,null,null,null,null,null,null,null,null,null,null,null,null,null,null,null,null,null,null,null,null,null,null,0,0,0,null,14,70,14,14,14]
["Baikal Teal","Sibirionetta formosa",null,null,null,null,null,null,null,null,null,null,null,null,null,null,null,null,null,null,null,null,null,null,null,null,null,null,null,null,null,null,null,null,null,null,null,null,null,null,null,null,null,0,0,0,null,15,82,15,15,15]
["Garganey","Spatula querquedula",null,null,null,null,null,null,null,null,null,null,null,null,null,null,null,null,null,null,null,null,null,null,null,null,null,null,null,null,null,null,null,null,null,null,null,null,null,null,null,null,null,0,0,0,null,16,81,16,16,16]
["Blue-winged Teal","Spatula discors",null,null,null,null,null,null,null,null,null,null,null,null,null,null,null,null,null,null,null,null,null,null,null,null,null,null,null,null,null,null,null,null,null,null,null,null,null,null,null,null,null,0,0,0,null,17,77,17,17,17]
["Cinnamon Teal","Spatula cyanoptera",null,null,null,null,null,null,null,null,null,null,null,null,null,null,null,null,null,null,null,null,null,null,null,null,null,null,null,null,null,null,null,null,null,null,null,null,null,null,null,null,null,0,0,0,null,18,78,18,18,18]
["Northern Shoveler","Spatula clypeata",null,null,null,null,null,null,null,null,null,null,null,null,null,null,null,null,null,null,null,null,null,null,null,null,null,null,null,null,null,null,null,null,null,null,null,null,null,null,null,null,null,0,0,0,null,19,79,19,19,19]
["Gadwall","Mareca strepera",null,null,null,null,null,null,null,null,null,null,null,null,null,null,null,null,null,null,null,null,null,null,null,null,null,null,null,null,null,null,null,null,null,null,null,null,null,null,null,null,null,0,0,0,null,20,71,20,20,20]
["Falcated Duck","Mareca falcata",null,null,null,null,null,null,null,null,null,null,null,null,null,null,null,null,null,null,null,null,null,null,null,null,null,null,null,null,null,null,null,null,null,null,null,null,null,null,null,null,null,0,0,0,null,21,72,21,21,21]
["Eurasian Wigeon","Mareca penelope",null,null,null,null,null,null,null,null,null,null,null,null,null,null,null,null,null,null,null,null,null,null,null,null,null,null,null,null,null,null,null,null,null,null,null,null,null,null,null,null,null,0,0,0,null,22,73,22,22,22]
["American Wigeon","Mareca americana",null,null,null,null,null,null,null,null,null,null,null,null,null,null,null,null,null,null,null,null,null,null,null,null,null,null,null,null,null,null,null,null,null,null,null,null,null,null,null,null,null,0,0,0,null,23,74,23,23,23]
["Mallard","Anas platyrhynchos",null,null,null,null,null,null,null,null,null,null,null,null,null,null,null,null,null,null,null,null,null,null,null,null,null,null,null,null,null,null,null,null,null,null,null,null,null,null,null,null,null,0,0,0,null,24,76,24,24,24]
["American Black Duck*","Anas rubripes",null,null,null,null,null,null,null,null,null,null,null,null,null,null,null,null,null,null,null,null,null,null,null,null,null,null,null,null,null,null,null,null,null,null,null,null,null,null,null,null,null,0,0,0,null,25,75,25,25,25]
["Northern Pintail","Anas acuta",null,null,null,null,null,null,null,null,null,null,null,null,null,null,null,null,null,null,null,null,null,null,null,null,null,null,null,null,null,null,null,null,null,null,null,null,null,null,null,null,null,0,0,0,null,26,80,26,26,26]
["Green-winged Teal","Anas crecca",null,null,null,null,null,null,null,null,null,null,null,null,null,null,null,null,null,null,null,null,null,null,null,null,null,null,null,null,null,null,null,null,null,null,null,null,null,null,null,null,null,0,0,0,null,27,83,27,27,27]
{"$rows_left_out":497}
{"sheet":"Species","index":1,"n_rows":80,"n_cols":69,"rows_kept":80,"cut":false,"hidden":false,"merged":[[1,1,3,2],[1,35,3,64],[9,67,11,67],[27,21,35,22],[6,1,8,1],[1,67,3,68],[9,68,11,68],[12,1,14,1],[12,2,14,2],[15,15,23,18],[18,2,20,2],[12,68,14,68],[15,1,17,1],[15,2,17,2],[15,67,17,67],[18,67,20,67],[6,68,8,68],[10,62,35,64],[9,1,11,1],[9,2,11,2],[18,1,20,1],[10,20,18,36],[10,37,26,50],[10,51,35,55],[6,2,8,2],[6,67,8,67],[21,2,23,2],[21,67,23,67],[10,56,35,61],[48,1,50,1],[48,2,50,2],[27,67,29,67],[48,67,50,67],[42,1,44,1],[42,2,44,2],[45,67,47,67],[27,42,42,50],[36,67,38,67],[39,1,41,1],[39,2,41,2],[24,67,26,67],[36,2,38,2],[39,67,41,67],[19,20,26,36],[21,1,23,1],[24,1,26,1],[24,2,26,2],[36,59,50,64],[33,68,35,68],[36,68,38,68],[36,1,38,1],[27,2,29,2],[27,68,29,68],[30,68,32,68],[27,24,38,33],[45,1,47,1],[45,2,47,2],[45,68,47,68],[44,8,61,14],[44,15,54,20],[27,34,47,41],[39,24,50,33],[38,21,50,22],[57,67,59,67],[51,1,53,1],[37,7,43,20],[30,67,32,67],[39,68,41,68],[51,67,53,67],[42,67,44,67],[54,67,56,67],[48,34,61,41],[55,15,61,20],[33,1,35,1],[26,5,36,18],[27,1,29,1],[30,1,32,1],[30,2,32,2],[51,2,53,2],[51,51,61,57],[33,2,35,2],[36,51,50,58],[51,21,61,33],[33,67,35,67],[24,68,26,68],[67,1,89,7],[63,68,65,68],[71,11,75,16],[71,17,78,23],[71,24,86,30],[70,61,79,63],[62,31,78,42],[63,1,65,1],[63,2,65,2],[79,19,89,23],[79,31,85,42],[66,67,68,67],[60,67,62,67],[60,68,62,68],[51,58,69,64],[54,1,56,1],[54,2,56,2],[60,1,62,1],[60,2,62,2],[57,1,59,1],[57,2,59,2],[62,14,70,30],[51,68,53,68],[1,21,3,26],[1,27,3,29],[1,30,3,31],[1,32,3,34],[57,68,59,68],[62,9,70,13],[43,42,61,50],[42,68,44,68],[18,68,20,68],[15,68,17,68],[21,68,23,68],[12,67,14,67],[66,68,68,68],[54,68,56,68],[62,43,81,48],[62,49,69,57],[70,49,79,57],[70,58,79,60],[70,64,79,65],[63,67,65,67],[5,27,7,34],[5,35,7,64],[48,68,50,68]]}
[null,null,null,null,null,null,null,null,null,null,null,null,null,null,null,null,null,null,null,null,null,null,null,null,null,null,null,null,null,null,null,null,39]
[null,"Western WA",null,null,null,null,null,null,null,null,null,null,null,null,null,null,null,null,null,null,null,"Have in:",null,null,null,null,null,0,null,null,"OF",null,2,null,null,"Fulvous Whistling-Duck",null,null,null,null,null,null,null,null,null,null,null,null,null,null,null,null,null,null,null,null,null,null,null,null,null,null,null,null,null,null,null,"Eastern WA"]
[]
[]
[]
[null,null,null,null,null,null,null,null,null,null,null,null,null,null,null,null,null,null,null,null,null,null,null,null,null,null,null,"Showing:",null,null,null,null,null,null,null,"Counties where I've seen the species"]
[null,"Clallam",{"$f":"INDEX(Master!$C$4:'Master'!$AP$564, MATCH($AJ$2, Master!$A$4:'Master'!$A$614, 0), MATCH($B7, Master!$C$1:'Master'!$AP$1, 0))","v":0},null,null,null,null,null,null,null,null,null,null,null,null,null,null,null,null,null,null,null,null,null,null,null,null,null,null,null,null,null,null,null,null,null,null,null,null,null,null,null,null,null,null,null,null,null,null,null,null,null,null,null,null,null,null,null,null,null,null,null,null,null,null,null,null,{"$f":"Master!W$1","v":"Adams"},{"$f":"INDEX(Master!$C$4:'Master'!$AP$564, MATCH($AJ$2, Master!$A$4:'Master'!$A$614, 0), MATCH($BP7, Master!$C$1:'Master'!$AP$1, 0))","v":0}]
[]
[]
[null,"Clark",{"$f":"INDEX(Master!$C$4:'Master'!$AP$564, MATCH($AJ$2, Master!$A$4:'Master'!$A$614, 0), MATCH($B10, Master!$C$1:'Master'!$AP$1, 0))","v":0},null,null,null,null,null,null,null,null,null,null,null,null,null,null,null,null,null,null,null,null,null,null,null,null,null,null,null,null,null,null,null,null,null,null,null,null,null,null,null,null,null,null,null,null,null,null,null,null,null,null,null,null,null,null,null,null,null,null,null,null,null,null,null,null,{"$f":"Master!X$1","v":"Asotin"},{"$f":"INDEX(Master!$C$4:'Master'!$AP$564, MATCH($AJ$2, Master!$A$4:'Master'!$A$614, 0), MATCH($BP10, Master!$C$1:'Master'!$AP$1, 0))","v":0}]
[null,null,null,null,null,null,null,null,null,null,null,null,null,null,null,null,null,null,null,null,{"$f":"B61","v":"Whatcom"},null,null,null,null,null,null,null,null,null,null,null,null,null,null,null,null,{"$f":"BP46","v":"Okanogan"},null,null,null,null,null,null,null,null,null,null,null,null,null,{"$f":"BP25","v":"Ferry"},null,null,null,null,{"$f":"BP55","v":"Stevens"},null,null,null,null,null,{"$f":"BP49","v":"Pend Oreille"}]
[]
[null,"Cowlitz",{"$f":"INDEX(Master!$C$4:'Master'!$AP$564, MATCH($AJ$2, Master!$A$4:'Master'!$A$614, 0), MATCH($B13, Master!$C$1:'Master'!$AP$1, 0))","v":0},null,null,null,null,null,null,null,null,null,null,null,null,null,null,null,null,null,null,null,null,null,null,null,null,null,null,null,null,null,null,null,null,null,null,null,null,null,null,null,null,null,null,null,null,null,null,null,null,null,null,null,null,null,null,null,null,null,null,null,null,null,null,null,null,{"$f":"Master!Y$1","v":"Benton"},{"$f":"INDEX(Master!$C$4:'Master'!$AP$564, MATCH($AJ$2, Master!$A$4:'Master'!$A$614, 0), MATCH($BP13, Master!$C$1:'Master'!$AP$1, 0))","v":0}]
[]
[]
[null,{"$f":"Master!F$1","v":"Grays Harbor"},{"$f":"INDEX(Master!$C$4:'Master'!$AP$564, MATCH($AJ$2, Master!$A$4:'Master'!$A$614, 0), MATCH($B16, Master!$C$1:'Master'!$AP$1, 0))","v":0},null,null,null,null,null,null,null,null,null,null,null,null,{"$f":"B43","v":"San Juan"},null,null,null,null,null,null,null,null,null,null,null,null,null,null,null,null,null,null,null,null,null,null,null,null,null,null,null,null,null,null,null,null,null,null,null,null,null,null,null,null,null,null,null,null,null,null,null,null,null,null,null,{"$f":"Master!Z$1","v":"Chelan"},{"$f":"INDEX(Master!$C$4:'Master'!$AP$564, MATCH($AJ$2, Master!$A$4:'Master'!$A$614, 0), MATCH($BP16, Master!$C$1:'Master'!$AP$1, 0))","v":0}]
[]
[]
[null,{"$f":"Master!G$1","v":"Island"},{"$f":"INDEX(Master!$C$4:'Master'!$AP$564, MATCH($AJ$2, Master!$A$4:'Master'!$A$614, 0), MATCH($B19, Master!$C$1:'Master'!$AP$1, 0))","v":0},null,null,null,null,null,null,null,null,null,null,null,null,null,null,null,null,null,null,null,null,null,null,null,null,null,null,null,null,null,null,null,null,null,null,null,null,null,null,null,null,null,null,null,null,null,null,null,null,null,null,null,null,null,null,null,null,null,null,null,null,null,null,null,null,{"$f":"Master!AA$1","v":"Columbia"},{"$f":"INDEX(Master!$C$4:'Master'!$AP$564, MATCH($AJ$2, Master!$A$4:'Master'!$A$614, 0), MATCH($BP19, Master!$C$1:'Master'!$AP$1, 0))","v":0}]
[null,null,null,null,null,null,null,null,null,null,null,null,null,null,null,null,null,null,null,null,{"$f":"B46","v":"Skagit"}]
[]
[null,{"$f":"Master!H$1","v":"Jefferson"},{"$f":"INDEX(Master!$C$4:'Master'!$AP$564, MATCH($AJ$2, Master!$A$4:'Master'!$A$614, 0), MATCH($B22, Master!$C$1:'Master'!$AP$1, 0))","v":0},null,null,null,null,null,null,null,null,null,null,null,null,null,null,null,null,null,null,null,null,null,null,null,null,null,null,null,null,null,null,null,null,null,null,null,null,null,null,null,null,null,null,null,null,null,null,null,null,null,null,null,null,null,null,null,null,null,null,null,null,null,null,null,null,{"$f":"Master!AB$1","v":"Douglas"},{"$f":"INDEX(Master!$C$4:'Master'!$AP$564, MATCH($AJ$2, Master!$A$4:'Master'!$A$614, 0), MATCH($BP22, Master!$C$1:'Master'!$AP$1, 0))","v":0}]
[]
[]
[null,{"$f":"Master!I$1","v":"King"},{"$f":"INDEX(Master!$C$4:'Master'!$AP$564, MATCH($AJ$2, Master!$A$4:'Master'!$A$614, 0), MATCH($B25, Master!$C$1:'Master'!$AP$1, 0))","v":0},null,null,null,null,null,null,null,null,null,null,null,null,null,null,null,null,null,null,null,null,null,null,null,null,null,null,null,null,null,null,null,null,null,null,null,null,null,null,null,null,null,null,null,null,null,null,null,null,null,null,null,null,null,null,null,null,null,null,null,null,null,null,null,null,{"$f":"Master!AC$1","v":"Ferry"},{"$f":"INDEX(Master!$C$4:'Master'!$AP$564, MATCH($AJ$2, Master!$A$4:'Master'!$A$614, 0), MATCH($BP25, Master!$C$1:'Master'!$AP$1, 0))","v":0}]
[]
[null,null,null,null,null,{"$f":"B7","v":"Clallam"}]
[null,{"$f":"Master!J$1","v":"Kitsap"},{"$f":"INDEX(Master!$C$4:'Master'!$AP$564, MATCH($AJ$2, Master!$A$4:'Master'!$A$614, 0), MATCH($B28, Master!$C$1:'Master'!$AP$1, 0))","v":0},null,null,null,null,null,null,null,null,null,null,null,null,null,null,null,null,null,null,{"$f":"B19","v":"Island"},null,null,{"$f":"B52","v":"Snohomish"},null,null,null,null,null,null,null,null,null,{"$f":"BP16","v":"Chelan"},null,null,null,null,null,null,null,{"$f":"BP22","v":"Douglas"},null,null,null,null,null,null,null,null,null,null,null,null,null,null,null,null,null,null,null,null,null,null,null,null,{"$f":"Master!AD$1","v":"Franklin"},{"$f":"INDEX(Master!$C$4:'Master'!$AP$564, MATCH($AJ$2, Master!$A$4:'Master'!$A$614, 0), MATCH($BP28, Master!$C$1:'Master'!$AP$1, 0))","v":0}]
[]
[]
{"$rows_left_out":51}
{"sheet":"Rank","index":2,"n_rows":84,"n_cols":69,"rows_kept":84,"cut":false,"hidden":false,"merged":[[66,68,68,68],[48,68,50,68],[18,68,20,68],[57,68,59,68],[63,68,65,68],[51,68,53,68],[60,67,62,67],[60,68,62,68],[42,67,44,67],[42,68,44,68],[45,67,47,67],[48,67,50,67],[24,68,26,68],[27,68,29,68],[45,68,47,68],[36,68,38,68],[27,67,29,67],[30,67,32,67],[33,67,35,67],[33,68,35,68],[39,68,41,68],[54,68,56,68],[51,67,53,67],[39,67,41,67],[68,2,70,2],[74,1,76,2],[77,1,79,1],[80,1,82,1],[83,1,85,1],[77,2,79,2],[80,2,82,2],[83,2,85,2],[62,9,70,13],[54,67,56,67],[43,42,61,50],[36,59,50,64],[36,67,38,67],[27,24,38,33],[63,67,65,67],[36,51,50,58],[27,42,42,50],[79,31,85,42],[66,67,68,67],[57,67,59,67],[70,64,79,65],[70,61,79,63],[70,49,79,57],[70,58,79,60],[62,14,70,30],[71,17,78,23],[71,24,86,30],[79,19,89,23],[42,2,44,2],[36,1,38,1],[51,1,53,1],[51,2,53,2],[44,8,61,14],[48,1,50,1],[48,2,50,2],[48,34,61,41],[51,58,69,64],[63,1,65,1],[63,2,65,2],[60,2,62,2],[37,7,43,20],[57,1,59,1],[57,2,59,2],[60,1,62,1],[39,24,50,33],[62,31,78,42],[62,43,81,48],[62,49,69,57],[51,21,61,33],[51,51,61,57],[71,11,75,16],[68,1,70,1],[18,2,20,2],[19,20,26,36],[21,1,23,1],[21,2,23,2],[30,1,32,1],[30,2,32,2],[33,1,35,1],[33,2,35,2],[38,21,50,22],[39,1,41,1],[45,1,47,1],[45,2,47,2],[27,21,36,23],[26,5,36,18],[36,2,38,2],[39,2,41,2],[44,15,54,20],[27,2,29,2],[27,34,47,41],[27,1,29,1],[54,1,56,1],[54,2,56,2],[55,15,61,20],[42,1,44,1],[15,68,17,68],[18,1,20,1],[9,68,11,68],[10,20,18,36],[10,37,26,50],[10,51,35,55],[10,56,35,61],[10,62,35,64],[30,68,32,68],[9,1,11,1],[15,1,17,1],[15,2,17,2],[15,15,23,18],[15,67,17,67],[12,1,14,1],[12,2,14,2],[12,67,14,67],[18,67,20,67],[12,68,14,68],[21,67,23,67],[21,68,23,68],[24,1,26,1],[24,2,26,2],[24,67,26,67],[1,23,5,25],[6,67,8,67],[6,68,8,68],[1,26,5,28],[1,29,5,31],[1,32,5,34],[1,35,5,37],[1,38,5,40],[9,2,11,2],[9,67,11,67],[1,20,5,22],[1,44,5,46],[1,1,3,2],[1,41,5,43],[1,4,6,18],[1,67,3,68],[6,1,8,1],[6,2,8,2],[10,4,12,18]]}
[null,null,null,null,null,null,null,null,null,null,null,null,null,null,null,null,null,null,null,null,null,null,null,null,null,null,null,null,null,null,null,null,39]
[null,"Western WA",null,null,"Counties colored according to county totals",null,null,null,null,null,null,null,null,null,null,null,null,null,null,null,0,null,null,25,null,null,50,null,null,75,null,null,100,null,null,125,null,null,150,null,null,175,null,null,200,null,null,null,null,null,null,null,null,null,null,null,null,null,null,null,null,null,null,null,null,null,null,"Eastern WA"]
[]
[]
[]
[]
[null,{"$f":"Master!C1","v":"Clallam"},{"$f":"Master!C3","v":0},null,null,null,null,null,null,null,null,null,null,null,null,null,null,null,null,null,null,null,null,null,null,null,null,null,null,null,null,null,null,null,null,null,null,null,null,null,null,null,null,null,null,null,null,null,null,null,null,null,null,null,null,null,null,null,null,null,null,null,null,null,null,null,null,{"$f":"Master!W$1","v":"Adams"},{"$f":"Master!W$3","v":0}]
[]
[]
[null,{"$f":"Master!D1","v":"Clark"},{"$f":"Master!D3","v":0},null,null,null,null,null,null,null,null,null,null,null,null,null,null,null,null,null,null,null,null,null,null,null,null,null,null,null,null,null,null,null,null,null,null,null,null,null,null,null,null,null,null,null,null,null,null,null,null,null,null,null,null,null,null,null,null,null,null,null,null,null,null,null,null,{"$f":"Master!X$1","v":"Asotin"},{"$f":"Master!X$3","v":0}]
[null,null,null,null,null,null,null,null,null,null,null,null,null,null,null,null,null,null,null,null,{"$f":"B61&\" \"&C61","v":"Whatcom 0"},null,null,null,null,null,null,null,null,null,null,null,null,null,null,null,null,{"$f":"BP46&\" \"&BQ46","v":"Okanogan 0"},null,null,null,null,null,null,null,null,null,null,null,null,null,{"$f":"BP25&\" \"&BQ25","v":"Ferry 0"},null,null,null,null,{"$f":"BP55&\" \"&BQ55","v":"Stevens 0"},null,null,null,null,null,{"$f":"BP49&\" \"&BQ49","v":"Pend Oreille 0"}]
[]
[null,{"$f":"Master!E1","v":"Cowlitz"},{"$f":"Master!E3","v":0},null,null,null,null,null,null,null,null,null,null,null,null,null,null,null,null,null,null,null,null,null,null,null,null,null,null,null,null,null,null,null,null,null,null,null,null,null,null,null,null,null,null,null,null,null,null,null,null,null,null,null,null,null,null,null,null,null,null,null,null,null,null,null,null,{"$f":"Master!Y$1","v":"Benton"},{"$f":"Master!Y$3","v":0}]
[]
[]
[null,{"$f":"Master!F1","v":"Grays Harbor"},{"$f":"Master!F3","v":0},null,null,null,null,null,null,null,null,null,null,null,null,{"$f":"B43&\" \"&C43","v":"San Juan 0"},null,null,null,null,null,null,null,null,null,null,null,null,null,null,null,null,null,null,null,null,null,null,null,null,null,null,null,null,null,null,null,null,null,null,null,null,null,null,null,null,null,null,null,null,null,null,null,null,null,null,null,{"$f":"Master!Z$1","v":"Chelan"},{"$f":"Master!Z$3","v":0}]
[]
[]
[null,{"$f":"Master!G1","v":"Island"},{"$f":"Master!G3","v":0},null,null,null,null,null,null,null,null,null,null,null,null,null,null,null,null,null,null,null,null,null,null,null,null,null,null,null,null,null,null,null,null,null,null,null,null,null,null,null,null,null,null,null,null,null,null,null,null,null,null,null,null,null,null,null,null,null,null,null,null,null,null,null,null,{"$f":"Master!AA$1","v":"Columbia"},{"$f":"Master!AA$3","v":0}]
[null,null,null,null,null,null,null,null,null,null,null,null,null,null,null,null,null,null,null,null,{"$f":"B46&\" \"&C46","v":"Skagit 0"}]
[]
[null,{"$f":"Master!H1","v":"Jefferson"},{"$f":"Master!H3","v":0},null,null,null,null,null,null,null,null,null,null,null,null,null,null,null,null,null,null,null,null,null,null,null,null,null,null,null,null,null,null,null,null,null,null,null,null,null,null,null,null,null,null,null,null,null,null,null,null,null,null,null,null,null,null,null,null,null,null,null,null,null,null,null,null,{"$f":"Master!AB$1","v":"Douglas"},{"$f":"Master!AB$3","v":0}]
[]
[]
[null,{"$f":"Master!I1","v":"King"},{"$f":"Master!I3","v":0},null,null,null,null,null,null,null,null,null,null,null,null,null,null,null,null,null,null,null,null,null,null,null,null,null,null,null,null,null,null,null,null,null,null,null,null,null,null,null,null,null,null,null,null,null,null,null,null,null,null,null,null,null,null,null,null,null,null,null,null,null,null,null,null,{"$f":"Master!AC$1","v":"Ferry"},{"$f":"Master!AC$3","v":0}]
[]
[null,null,null,null,null,{"$f":"B7&\" \"&C7","v":"Clallam 0"}]
[null,{"$f":"Master!J1","v":"Kitsap"},{"$f":"Master!J3","v":0},null,null,null,null,null,null,null,null,null,null,null,null,null,null,null,null,null,null,{"$f":"B19&\" \"&C19","v":"Island 0"},null,null,{"$f":"B52&\" \"&C52","v":"Snohomish 0"},null,null,null,null,null,null,null,null,null,{"$f":"BP16&\" \"&BQ16","v":"Chelan 0"},null,null,null,null,null,null,null,{"$f":"BP22&\" \"&BQ22","v":"Douglas 0"},null,null,null,null,null,null,null,null,null,null,null,null,null,null,null,null,null,null,null,null,null,null,null,null,{"$f":"Master!AD$1","v":"Franklin"},{"$f":"Master!AD$3","v":0}]
[]
[]
{"$rows_left_out":54}